BDBM50077872 CHEMBL3417081::US9611229, 64
SMILES CCN(CCN1CCOCC1)c1cn(nn1)C12CC3CC(CC(C3)C1)C2
InChI Key InChIKey=YWUCYDLHHYYQRZ-UHFFFAOYSA-N
Data  2 KI  1 IC50
  Tab Delimited (TSV)   2D SDfile   Computed 3D by Vconf -m prep SDfile
Find this compound or compounds like it in BindingDB:
Activity Spreadsheet -- Enzyme Inhibition Constant Data from BindingDB
Found 3 hits for monomerid = 50077872
TargetSigma non-opioid intracellular receptor 1(Homo sapiens (Human))
Esteve
Curated by ChEMBL
LigandPNGBDBM50077872(CHEMBL3417081 | US9611229, 64)
Affinity DataKi:  111nM. Assay description: Displacement of [3H](+)-pentazocine from human sigma 1 receptor transfected in HEK293 cells after 120 mins by liquid scintillation counting
In DepthDetails ArticlePubMed
TargetSigma non-opioid intracellular receptor 1(Mus musculus (Mouse))
Laboratorios Del Dr. Esteve
US Patent
LigandPNGBDBM50077872(CHEMBL3417081 | US9611229, 64)
Affinity DataKi:  111nM. Assay description: Brain membrane preparation and binding assays for the 61-receptor were performed as described (DeHaven-Hudkins, D. L., L. C. Fleissner, and F. Y. For...
In DepthDetails US Patent
TargetPotassium voltage-gated channel subfamily H member 2(Homo sapiens (Human))
Esteve
Curated by ChEMBL
LigandPNGBDBM50077872(CHEMBL3417081 | US9611229, 64)
Affinity DataIC50: >1.00E+4nM. Assay description: Inhibition of human ERG expressed in CHO cells at -80 mV holding potential by whole cell patch clamp assay
In DepthDetails ArticlePubMed