BDBM50077890 CHEMBL3417063::US9611229, 7
SMILES Clc1ccc(Cn2cc(NCCN3CCOCC3)nn2)cc1Cl
InChI Key InChIKey=YDJMFRCIYYGGNA-UHFFFAOYSA-N
Data  3 KI  1 IC50
  Tab Delimited (TSV)   2D SDfile   Computed 3D by Vconf -m prep SDfile
Find this compound or compounds like it in BindingDB:
Activity Spreadsheet -- Enzyme Inhibition Constant Data from BindingDB
Found 4 hits for monomerid = 50077890
TargetSigma non-opioid intracellular receptor 1(Homo sapiens (Human))
Esteve
Curated by ChEMBL
LigandPNGBDBM50077890(CHEMBL3417063 | US9611229, 7)
Affinity DataKi:  61nM. Assay description: Displacement of [3H](+)-pentazocine from human sigma 1 receptor transfected in HEK293 cells after 120 mins by liquid scintillation counting
In DepthDetails ArticlePubMed
TargetSigma non-opioid intracellular receptor 1(Homo sapiens (Human))
Esteve
Curated by ChEMBL
LigandPNGBDBM50077890(CHEMBL3417063 | US9611229, 7)
Affinity DataKi:  61nM. Assay description: Displacement of [3H]-(+)-pentazocine from recombinant human sigma1 receptor expressed in HEK293 cell membranes after 120 mins by microbeta scintillat...
In DepthDetails ArticlePubMed
TargetSigma non-opioid intracellular receptor 1(Mus musculus (Mouse))
Laboratorios Del Dr. Esteve
US Patent
LigandPNGBDBM50077890(CHEMBL3417063 | US9611229, 7)
Affinity DataKi:  61.1nM. Assay description: Brain membrane preparation and binding assays for the 61-receptor were performed as described (DeHaven-Hudkins, D. L., L. C. Fleissner, and F. Y. For...
In DepthDetails US Patent
TargetPotassium voltage-gated channel subfamily H member 2(Homo sapiens (Human))
Esteve
Curated by ChEMBL
LigandPNGBDBM50077890(CHEMBL3417063 | US9611229, 7)
Affinity DataIC50: >1.00E+4nM. Assay description: Inhibition of human ERG expressed in CHO cells at -80 mV holding potential by whole cell patch clamp assay
In DepthDetails ArticlePubMed