BDBM50079007 CHEMBL314169::{1-[3-(3-Isopropyl-ureido)-benzyl]-2-oxo-2,3,4,5-tetrahydro-1H-benzo[b]azepin-3-yl}-carbamic acid phenyl ester
SMILES CC(C)NC(=O)Nc1cccc(CN2c3ccccc3CCC(NC(=O)Oc3ccccc3)C2=O)c1
InChI Key InChIKey=TWFLDGQXHBUTCU-UHFFFAOYSA-N
Data  1 KI
  Tab Delimited (TSV)   2D SDfile   Computed 3D by Vconf -m prep SDfile
Find this compound or compounds like it in BindingDB:
Activity Spreadsheet -- Enzyme Inhibition Constant Data from BindingDB
Found 1 hit for monomerid = 50079007
TargetNeuropeptide Y receptor type 1(Homo sapiens (Human))
Shionogi
Curated by ChEMBL
LigandPNGBDBM50079007(CHEMBL314169 | {1-[3-(3-Isopropyl-ureido)-benzyl]-...)
Affinity DataKi:  2.10E+3nM. Assay description: In vitro binding affinity towards Neuropeptide Y receptor type 1 was determined as potency to displace [125I]-peptide YY binding to human neuroblasto...
In DepthDetails ArticlePubMed