BDBM50079015 1-(2,4-Difluoro-phenyl)-3-{1-[3-(3-isopropyl-ureido)-benzyl]-2-oxo-2,3,4,5-tetrahydro-1H-benzo[b]azepin-3-yl}-urea::CHEMBL557948
SMILES CC(C)NC(=O)Nc1cccc(CN2c3ccccc3CCC(NC(=O)Nc3ccc(F)cc3F)C2=O)c1
InChI Key InChIKey=WBDAJKSOSJQFFZ-UHFFFAOYSA-N
Data  1 KI
  Tab Delimited (TSV)   2D SDfile   Computed 3D by Vconf -m prep SDfile
Find this compound or compounds like it in BindingDB:
Activity Spreadsheet -- Enzyme Inhibition Constant Data from BindingDB
Found 1 hit for monomerid = 50079015
TargetNeuropeptide Y receptor type 1(Homo sapiens (Human))
Shionogi
Curated by ChEMBL
LigandPNGBDBM50079015(1-(2,4-Difluoro-phenyl)-3-{1-[3-(3-isopropyl-ureid...)
Affinity DataKi:  7.80nM. Assay description: In vitro binding affinity towards Neuropeptide Y receptor type 1 was determined as potency to displace [125I]-peptide YY binding to human neuroblasto...
In DepthDetails ArticlePubMed