BDBM50079601 CHEMBL293269::N-(4-Methyl-pyrimidin-2-yl)-2-nitro-benzenesulfonamide
SMILES Cc1ccnc(NS(=O)(=O)c2ccccc2[N+]([O-])=O)n1
InChI Key InChIKey=GBJICDJEWNSZSA-UHFFFAOYSA-N
Data  1 IC50
  Tab Delimited (TSV)   2D SDfile   Computed 3D by Vconf -m prep SDfile
Find this compound or compounds like it in BindingDB:
Activity Spreadsheet -- Enzyme Inhibition Constant Data from BindingDB
Found 1 hit for monomerid = 50079601
TargetAcetolactate synthase, chloroplastic(Arabidopsis thaliana)
Nankai University
Curated by ChEMBL
LigandPNGBDBM50079601(CHEMBL293269 | N-(4-Methyl-pyrimidin-2-yl)-2-nitro...)
Affinity DataIC50:  2.87E+5nM. Assay description: Inhibitory activity against Acetolactate synthase (ALS) enzyme by using the rape-root growth method
In DepthDetails ArticlePubMed