BDBM50079944 CHEMBL114852::[1-(2,3-Dihydro-benzo[1,4]dioxin-2-ylmethyl)-piperidin-4-ylmethyl]-(2-methoxy-phenyl)-amine
SMILES COc1ccccc1NCC1CCN(CC2COc3ccccc3O2)CC1
InChI Key InChIKey=TYCFPCOJYDWOEP-UHFFFAOYSA-N
Data  2 KI
  Tab Delimited (TSV)   2D SDfile   Computed 3D by Vconf -m prep SDfile
Find this compound or compounds like it in BindingDB:
Activity Spreadsheet -- Enzyme Inhibition Constant Data from BindingDB
Found 2 hits for monomerid = 50079944
Target5-hydroxytryptamine receptor 1A(Rattus norvegicus (rat))
Knoll Pharmaceuticals
Curated by ChEMBL
LigandPNGBDBM50079944(CHEMBL114852 | [1-(2,3-Dihydro-benzo[1,4]dioxin-2-...)
Affinity DataKi:  20nM. Assay description: Binding affinity towards 5-hydroxytryptamine 1A receptor from rat brain using [3H]-8-OH-DPAT as radioligand
In DepthDetails ArticlePubMed
TargetD(2) dopamine receptor(Rattus norvegicus (rat))
Knoll Pharmaceuticals
Curated by ChEMBL
LigandPNGBDBM50079944(CHEMBL114852 | [1-(2,3-Dihydro-benzo[1,4]dioxin-2-...)
Affinity DataKi:  69nM. Assay description: Binding affinity of the compound to the dopamine receptor D2L in rat brain membranes
In DepthDetails ArticlePubMed