BDBM50079952 CHEMBL112526::[1-(2-Chloro-phenyl)-piperidin-4-ylmethyl]-(2,3-dihydro-benzo[1,4]dioxin-2-ylmethyl)-amine
SMILES Clc1ccccc1N1CCC(CNCC2COc3ccccc3O2)CC1
InChI Key InChIKey=CSWPZFOPVQMWKT-UHFFFAOYSA-N
Data  2 KI
  Tab Delimited (TSV)   2D SDfile   Computed 3D by Vconf -m prep SDfile
Find this compound or compounds like it in BindingDB:
Activity Spreadsheet -- Enzyme Inhibition Constant Data from BindingDB
Found 2 hits for monomerid = 50079952
Target5-hydroxytryptamine receptor 1A(Rattus norvegicus (rat))
Knoll Pharmaceuticals
Curated by ChEMBL
LigandPNGBDBM50079952(CHEMBL112526 | [1-(2-Chloro-phenyl)-piperidin-4-yl...)
Affinity DataKi:  17nM. Assay description: Binding affinity towards 5-hydroxytryptamine 1A receptor from rat brain using [3H]-8-OH-DPAT as radioligand
In DepthDetails ArticlePubMed
TargetD(2) dopamine receptor(Rattus norvegicus (rat))
Knoll Pharmaceuticals
Curated by ChEMBL
LigandPNGBDBM50079952(CHEMBL112526 | [1-(2-Chloro-phenyl)-piperidin-4-yl...)
Affinity DataKi:  30nM. Assay description: Binding affinity of the compound to the dopamine receptor D2L in rat brain membranes
In DepthDetails ArticlePubMed