BDBM5008 (3R,4R,5S)-5-carbamimidamido-4-acetamido-3-hydroxycyclohex-1-ene-1-carboxylic acid::Carbocyclic Analogue 58
SMILES CC(=O)N[C@H]1[C@H](O)C=C(C[C@@H]1N=C(N)N)C(O)=O
InChI Key InChIKey=DLBPVPLABVAVJF-XLPZGREQSA-N
Data  2 IC50
  Tab Delimited (TSV)   2D SDfile   Computed 3D by Vconf -m prep SDfile
Find this compound or compounds like it in BindingDB:
Activity Spreadsheet -- Enzyme Inhibition Constant Data from BindingDB
Found 2 hits for monomerid = 5008
TargetSialidase(Clostridium perfringens)
Shanghai Institute Of Technology
Curated by ChEMBL
LigandPNGBDBM5008((3R,4R,5S)-5-carbamimidamido-4-acetamido-3-hydroxy...)
Affinity DataIC50:  100nM. Assay description: Inhibition of Clostridium perfringenes neuraminidase activity using 4-methylumbelliferyl-1-alpha-D-N-acetylneuramic acid sodium salt hydrate as subst...
In DepthDetails ArticlePubMed
TargetNeuraminidase(Influenza A virus (A/Puerto Rico/8/34/Mount Sinai(...)
Gilead Sciences
LigandPNGBDBM5008((3R,4R,5S)-5-carbamimidamido-4-acetamido-3-hydroxy...)
Affinity DataIC50:  100nM. Assay description: A standard fluorimetric assay was used to measure influenza virus neuraminidase activity. The substrate 2 -(4-methylumbelliferyl)-alpha-D-acetylneura...
In DepthDetails ArticlePubMed