BDBM50080181 CHEMBL77338::Phosphoric acid mono-(4-{(S)-2-acetylamino-2-[(S)-1-(3-heptyl-[1,2,4]oxadiazol-5-yl)-propylcarbamoyl]-ethyl}-phenyl) ester
SMILES CCCCCCCc1noc(n1)[C@H](CC)NC(=O)[C@H](Cc1ccc(OP(O)(O)=O)cc1)NC(C)=O
InChI Key InChIKey=QPPYOPLFBARXOD-PMACEKPBSA-N
Data  1 IC50
  Tab Delimited (TSV)   2D SDfile   Computed 3D by Vconf -m prep SDfile
Find this compound or compounds like it in BindingDB:
Activity Spreadsheet -- Enzyme Inhibition Constant Data from BindingDB
Found 1 hit for monomerid = 50080181
TargetProto-oncogene tyrosine-protein kinase Src(Homo sapiens (Human))
Ariad Pharmaceuticals
Curated by ChEMBL
LigandPNGBDBM50080181(CHEMBL77338 | Phosphoric acid mono-(4-{(S)-2-acety...)
Affinity DataIC50:  2.20E+4nM. Assay description: Binding affinity against Src-homology 2 (SRC SH2).
In DepthDetails ArticlePubMed