BDBM50080750 (S)-2-({5-[(Benzyl-pyrimidin-5-yl-amino)-methyl]-2'-methyl-biphenyl-2-carbonyl}-amino)-4-methylsulfanyl-butyric acid::CHEMBL123339
SMILES CSCC[C@H](NC(=O)c1ccc(CN(Cc2ccccc2)c2cncnc2)cc1-c1ccccc1C)C(O)=O
InChI Key InChIKey=QOYQTCCJBBAVRY-LJAQVGFWSA-N
Data  1 IC50
  Tab Delimited (TSV)   2D SDfile   Computed 3D by Vconf -m prep SDfile
Find this compound or compounds like it in BindingDB:
Activity Spreadsheet -- Enzyme Inhibition Constant Data from BindingDB
Found 1 hit for monomerid = 50080750
LigandPNGBDBM50080750((S)-2-({5-[(Benzyl-pyrimidin-5-yl-amino)-methyl]-2...)
Affinity DataIC50:  0.400nM. Assay description: In vitro inhibition of farnesyltransferase purified from bovine brain using scintillation proximity assay
In DepthDetails ArticlePubMed