BDBM50081323 4-(4-Bromo-6,7-dihydroxy-1-oxo-1H-isoquinolin-2-yl)-butyric acid ethyl ester::CHEMBL124975
SMILES CCOC(=O)CCCn1cc(Br)c2cc(O)c(O)cc2c1=O
InChI Key InChIKey=QJWJIDZOQONWRO-UHFFFAOYSA-N
Data  1 IC50
  Tab Delimited (TSV)   2D SDfile   Computed 3D by Vconf -m prep SDfile
Find this compound or compounds like it in BindingDB:
Activity Spreadsheet -- Enzyme Inhibition Constant Data from BindingDB
Found 1 hit for monomerid = 50081323
TargetTumor necrosis factor(Homo sapiens (Human))
University Of California
Curated by ChEMBL
LigandPNGBDBM50081323(4-(4-Bromo-6,7-dihydroxy-1-oxo-1H-isoquinolin-2-yl...)
Affinity DataIC50:  1.00E+3nM. Assay description: The compound was tested in vitro for inhibitory activity against Tumor necrosis factor alpha from human PMBC cell line by ELISA test.
In DepthDetails ArticlePubMed