BDBM50081690 (S)-1-{4-[(4-Benzyloxy-phenyl)-(3-methyl-but-2-enyl)-amino]-piperidin-1-yl}-2-cyclohexylamino-4-methyl-pentan-1-one::CHEMBL336605
SMILES [#6]-[#6](-[#6])-[#6]-[#6@H](-[#7]-[#6]-1-[#6]-[#6]-[#6]-[#6]-[#6]-1)-[#6](=O)-[#7]-1-[#6]-[#6]-[#6](-[#6]-[#6]-1)-[#7](-[#6]\[#6]=[#6](\[#6])-[#6])-c1ccc(-[#8]-[#6]-c2ccccc2)cc1
InChI Key InChIKey=HJWVGVATLANLOD-UMSFTDKQSA-N
Data  1 IC50
  Tab Delimited (TSV)   2D SDfile   Computed 3D by Vconf -m prep SDfile
Find this compound or compounds like it in BindingDB:
Activity Spreadsheet -- Enzyme Inhibition Constant Data from BindingDB
Found 1 hit for monomerid = 50081690
TargetVoltage-dependent N-type calcium channel subunit alpha-1B(Homo sapiens (Human))
Warner-Lambert
Curated by ChEMBL
LigandPNGBDBM50081690((S)-1-{4-[(4-Benzyloxy-phenyl)-(3-methyl-but-2-eny...)
Affinity DataIC50:  510nM. Assay description: Inhibition of N-type calcium channels in IMR32 human neuroblastoma cells
In DepthDetails ArticlePubMed