BDBM50081750 1-[4-(1H-Imidazol-4-yl)-but-3-ynyl]-4-phenyl-piperidin-4-ol::CHEMBL432826
SMILES OC1(CCN(CCC#Cc2cnc[nH]2)CC1)c1ccccc1
InChI Key InChIKey=TWXXVWZCUMLSMF-UHFFFAOYSA-N
Data  3 IC50
  Tab Delimited (TSV)   2D SDfile   Computed 3D by Vconf -m prep SDfile
Find this compound or compounds like it in BindingDB:
Activity Spreadsheet -- Enzyme Inhibition Constant Data from BindingDB
Found 3 hits for monomerid = 50081750
TargetGlutamate receptor ionotropic, NMDA 3A(Rattus norvegicus (Rat))
Warner-Lambert
Curated by ChEMBL
LigandPNGBDBM50081750(1-[4-(1H-Imidazol-4-yl)-but-3-ynyl]-4-phenyl-piper...)
Affinity DataIC50:  8.40E+3nM. Assay description: Compound was tested in vitro for inhibition of NMDA response at cloned NR1A/2A receptor expressed in Xenopus oocytes
In DepthDetails ArticlePubMed
TargetGlutamate receptor ionotropic, NMDA 1/2B(Rattus norvegicus (Rat))
Warner-Lambert
Curated by ChEMBL
LigandPNGBDBM50081750(1-[4-(1H-Imidazol-4-yl)-but-3-ynyl]-4-phenyl-piper...)
Affinity DataIC50:  3.50E+3nM. Assay description: Inhibition of NMDA response at NR1A/2B receptor expressed in Xenopus oocytes
In DepthDetails ArticlePubMed
TargetGlutamate receptor ionotropic, NMDA 2C(Rattus norvegicus (Rat))
Warner-Lambert
Curated by ChEMBL
LigandPNGBDBM50081750(1-[4-(1H-Imidazol-4-yl)-but-3-ynyl]-4-phenyl-piper...)
Affinity DataIC50:  3.60E+4nM. Assay description: Compound was tested in vitro for inhibition of NMDA response at cloned NR1A/2C receptor expressed in Xenopus oocytes
In DepthDetails ArticlePubMed