BDBM50082572 CHEMBL337532::Pentanedioic acid mono-(2-{1-[5-guanidino-2-(3-methyl-1,2,3,4-tetrahydro-quinoline-8-sulfonylamino)-pentanoyl]-piperidin-4-yl}-ethyl) ester
SMILES CC1CNc2c(C1)cccc2S(=O)(=O)NC(CCCNC(N)=N)C(=O)N1CCC(CCOC(=O)CCCC(O)=O)CC1
InChI Key InChIKey=GYMAOWFZTDIMQR-UHFFFAOYSA-N
Data  1 KI
  Tab Delimited (TSV)   2D SDfile   Computed 3D by Vconf -m prep SDfile
Find this compound or compounds like it in BindingDB:
Activity Spreadsheet -- Enzyme Inhibition Constant Data from BindingDB
Found 1 hit for monomerid = 50082572
TargetProthrombin(Bos taurus (Bovine))
Novartis Horsham Research Centre
Curated by ChEMBL
LigandPNGBDBM50082572(CHEMBL337532 | Pentanedioic acid mono-(2-{1-[5-gua...)
Affinity DataKi:  170nM. Assay description: Inhibitory activity against bovine thrombin
In DepthDetails ArticlePubMed