BDBM50082585 3-Methyl-1,2,3,4-tetrahydro-quinoline-8-sulfonic acid [4-guanidino-1-(4-hydroxy-piperidine-1-carbonyl)-butyl]-amide::CHEMBL140090
SMILES CC1CNc2c(C1)cccc2S(=O)(=O)NC(CCCNC(N)=N)C(=O)N1CCC(O)CC1
InChI Key InChIKey=FPPNPNRBRLELTJ-UHFFFAOYSA-N
Data  1 KI
  Tab Delimited (TSV)   2D SDfile   Computed 3D by Vconf -m prep SDfile
Find this compound or compounds like it in BindingDB:
Activity Spreadsheet -- Enzyme Inhibition Constant Data from BindingDB
Found 1 hit for monomerid = 50082585
TargetProthrombin(Bos taurus (Bovine))
Novartis Horsham Research Centre
Curated by ChEMBL
LigandPNGBDBM50082585(3-Methyl-1,2,3,4-tetrahydro-quinoline-8-sulfonic a...)
Affinity DataKi:  5.18E+3nM. Assay description: Inhibitory activity against bovine thrombin
In DepthDetails ArticlePubMed