BDBM50082593 3-{1-[5-Guanidino-2-(3-methyl-1,2,3,4-tetrahydro-quinoline-8-sulfonylamino)-pentanoyl]-piperidin-4-yl}-propionic acid::CHEMBL358719
SMILES CC1CNc2c(C1)cccc2S(=O)(=O)NC(CCCNC(N)=N)C(=O)N1CCC(CCC(O)=O)CC1
InChI Key InChIKey=MPUXVXNFIBVQBV-UHFFFAOYSA-N
Data  1 KI
  Tab Delimited (TSV)   2D SDfile   Computed 3D by Vconf -m prep SDfile
Find this compound or compounds like it in BindingDB:
Activity Spreadsheet -- Enzyme Inhibition Constant Data from BindingDB
Found 1 hit for monomerid = 50082593
TargetProthrombin(Bos taurus (Bovine))
Novartis Horsham Research Centre
Curated by ChEMBL
LigandPNGBDBM50082593(3-{1-[5-Guanidino-2-(3-methyl-1,2,3,4-tetrahydro-q...)
Affinity DataKi:  1.84E+4nM. Assay description: Inhibitory activity against bovine thrombin
In DepthDetails ArticlePubMed