BDBM50082605 3-Methyl-1,2,3,4-tetrahydro-quinoline-8-sulfonic acid [4-guanidino-1-(3-hydroxy-piperidine-1-carbonyl)-butyl]-amide::CHEMBL139548
SMILES CC1CNc2c(C1)cccc2S(=O)(=O)NC(CCCNC(N)=N)C(=O)N1CCCC(O)C1
InChI Key InChIKey=PDSIFDCCDCLQJN-UHFFFAOYSA-N
Data  1 KI
  Tab Delimited (TSV)   2D SDfile   Computed 3D by Vconf -m prep SDfile
Find this compound or compounds like it in BindingDB:
Activity Spreadsheet -- Enzyme Inhibition Constant Data from BindingDB
Found 1 hit for monomerid = 50082605
TargetProthrombin(Bos taurus (Bovine))
Novartis Horsham Research Centre
Curated by ChEMBL
LigandPNGBDBM50082605(3-Methyl-1,2,3,4-tetrahydro-quinoline-8-sulfonic a...)
Affinity DataKi:  360nM. Assay description: Inhibitory activity against bovine thrombin
In DepthDetails ArticlePubMed