BDBM50082609 CHEMBL140911::N-[4-Guanidino-1-((S)-2-hydroxymethyl-pyrrolidine-1-carbonyl)-butyl]-3-(1-methyl-1-phenyl-ethyl)-benzenesulfonamide
SMILES CC(C)(c1ccccc1)c1cccc(c1)S(=O)(=O)NC(CCCNC(N)=N)C(=O)N1CCC[C@H]1CO
InChI Key InChIKey=ADQOBGGARMQZSK-BBQAJUCSSA-N
Data  1 KI
  Tab Delimited (TSV)   2D SDfile   Computed 3D by Vconf -m prep SDfile
Find this compound or compounds like it in BindingDB:
Activity Spreadsheet -- Enzyme Inhibition Constant Data from BindingDB
Found 1 hit for monomerid = 50082609
TargetProthrombin(Bos taurus (Bovine))
Novartis Horsham Research Centre
Curated by ChEMBL
LigandPNGBDBM50082609(CHEMBL140911 | N-[4-Guanidino-1-((S)-2-hydroxymeth...)
Affinity DataKi:  2.90E+3nM. Assay description: Inhibitory activity against bovine thrombin
In DepthDetails ArticlePubMed