BDBM50083177 1H-Benzoimidazole-4-carboxylic acid (8-methyl-8-aza-bicyclo[3.2.1]oct-3-yl)-amide::CHEMBL150155
SMILES CN1C2CCC1CC(C2)NC(=O)c1cccc2nc[nH]c12
InChI Key InChIKey=CUGYVBTWCOQFBN-UHFFFAOYSA-N
Data  2 KI
  Tab Delimited (TSV)   2D SDfile   Computed 3D by Vconf -m prep SDfile
Find this compound or compounds like it in BindingDB:
Activity Spreadsheet -- Enzyme Inhibition Constant Data from BindingDB
Found 2 hits for monomerid = 50083177
Target5-hydroxytryptamine receptor 3A/3B(Rattus norvegicus)
Universidad Complutense
Curated by ChEMBL
LigandPNGBDBM50083177(1H-Benzoimidazole-4-carboxylic acid (8-methyl-8-az...)
Affinity DataKi:  118nM. Assay description: In vitro affinity at serotonergic 5-hydroxytryptamine 3 receptor by radioligand binding assay, using [3H]-LY 278584 in rat cerebral cortex membranes.
In DepthDetails ArticlePubMed
Target5-hydroxytryptamine receptor 4(RAT)
Universidad Complutense
Curated by ChEMBL
LigandPNGBDBM50083177(1H-Benzoimidazole-4-carboxylic acid (8-methyl-8-az...)
Affinity DataKi: >1.00E+4nM. Assay description: In vitro affinity at serotonergic 5-hydroxytryptamine 4 receptor by radioligand binding assay using [3H]GR-113808 in rat striatum membranes.
In DepthDetails ArticlePubMed