BDBM50083529 4-(4-Fluoro-phenyl)-1-methyl-piperidine-4-carboxylic acid ethyl ester::CHEMBL112817::CHEMBL539845
SMILES CCOC(=O)C1(CCN(C)CC1)c1ccc(F)cc1
InChI Key InChIKey=CHOQGLPFQOQESN-UHFFFAOYSA-N
Data  4 KI
  Tab Delimited (TSV)   2D SDfile   Computed 3D by Vconf -m prep SDfile
Find this compound or compounds like it in BindingDB:
Activity Spreadsheet -- Enzyme Inhibition Constant Data from BindingDB
Found 4 hits for monomerid = 50083529
TargetSodium-dependent serotonin transporter(Rattus norvegicus (rat))
University Of New Orleans
Curated by ChEMBL
LigandPNGBDBM50083529(4-(4-Fluoro-phenyl)-1-methyl-piperidine-4-carboxyl...)
Affinity DataKi:  308nM. Assay description: Inhibition of [3H]paroxetine binding to rat serotonin transporter
In DepthDetails ArticlePubMed
TargetSodium-dependent serotonin transporter(Rattus norvegicus (rat))
University Of New Orleans
Curated by ChEMBL
LigandPNGBDBM50083529(4-(4-Fluoro-phenyl)-1-methyl-piperidine-4-carboxyl...)
Affinity DataKi:  308nM. Assay description: Displacement of [3H]-paroxetine from serotonin transporter (SERT)
In DepthDetails ArticlePubMed
TargetSodium-dependent dopamine transporter(Rattus norvegicus (rat))
University Of New Orleans
Curated by ChEMBL
LigandPNGBDBM50083529(4-(4-Fluoro-phenyl)-1-methyl-piperidine-4-carboxyl...)
Affinity DataKi:  1.07E+4nM. Assay description: Inhibition of [3H]WIN-35428 binding to rat dopamine transporter
In DepthDetails ArticlePubMed
TargetSodium-dependent dopamine transporter(Rattus norvegicus (rat))
University Of New Orleans
Curated by ChEMBL
LigandPNGBDBM50083529(4-(4-Fluoro-phenyl)-1-methyl-piperidine-4-carboxyl...)
Affinity DataKi:  1.07E+4nM. Assay description: Displacement of [3H]-WIN- 35,428 from dopamine transporter (DAT)
In DepthDetails ArticlePubMed