BDBM50084387 CHEMBL3426132
SMILES C[C@@H]1CC[C@H](CN1C(=O)c1ccccc1-n1nccn1)Oc1ncccc1C
InChI Key InChIKey=RFMRGEGEHMGZBG-IAGOWNOFSA-N
Data  2 KI
  Tab Delimited (TSV)   2D SDfile   Computed 3D by Vconf -m prep SDfile
Find this compound or compounds like it in BindingDB:
Activity Spreadsheet -- Enzyme Inhibition Constant Data from BindingDB
Found 2 hits for monomerid = 50084387
TargetOrexin receptor type 2(Homo sapiens (Human))
Merck Research Laboratories
Curated by ChEMBL
LigandPNGBDBM50084387(CHEMBL3426132)
Affinity DataKi:  621nM. Assay description: Displacement of [3H]-(S)-N-(2-(1H-pyrrol-1-yl)phenyl)-1-(2-(1-methyl-1H-benzo[d]imidazol-2-ylthio)acetyl)pyrrolidine-2-carboxamide from human OX2R ex...
In DepthDetails ArticlePubMed
TargetOrexin/Hypocretin receptor type 1(Homo sapiens (Human))
Merck Research Laboratories
Curated by ChEMBL
LigandPNGBDBM50084387(CHEMBL3426132)
Affinity DataKi:  4.76E+3nM. Assay description: Displacement of [3H]-(S)-N-(biphenyl-2-yl)-1-(2-(1-methyl-1H-benzo[d]imidazol-2-ylthio)acetyl)pyrrolidine-2-carboxamide from human OX1R expressed in ...
In DepthDetails ArticlePubMed