BDBM50084688 2-Amino-N-[1-[1-(1-cyclohexylmethyl-2,3-dihydroxy-5-methyl-hexylcarbamoyl)-2-(1H-imidazol-4-yl)-ethylcarbamoyl]-2-(4-methoxy-phenyl)-ethyl]-2-methyl-propionamide(enalkiren)::CHEMBL323839
SMILES COc1ccc(C[C@H](NC(=O)C(C)(C)N)C(=O)N[C@@H](Cc2cnc[nH]2)C(=O)N[C@@H](CC2CCCCC2)[C@@H](O)[C@@H](O)CC(C)C)cc1
InChI Key InChIKey=UGXKCYZOKRDKII-VFFRCKCKSA-N
Data  1 KI
  Tab Delimited (TSV)   2D SDfile   Computed 3D by Vconf -m prep SDfile
Find this compound or compounds like it in BindingDB:
Activity Spreadsheet -- Enzyme Inhibition Constant Data from BindingDB
Found 1 hit for monomerid = 50084688
TargetRenin(Homo sapiens (Human))
University Of Queensland
Curated by ChEMBL
LigandPNGBDBM50084688(2-Amino-N-[1-[1-(1-cyclohexylmethyl-2,3-dihydroxy-...)
Affinity DataKi:  14nM. Assay description: Binding affinity against aspartic protease renin.Checked by Author
In DepthDetails ArticlePubMed