BDBM50084726 4-(Biphenyl-4-carbonyl)-1-(4-methoxy-benzenesulfonyl)-piperazine-2-carboxylic acid hydroxyamide::CHEMBL125598
SMILES COc1ccc(cc1)S(=O)(=O)N1CCN(CC1C(=O)NO)C(=O)c1ccc(cc1)-c1ccccc1
InChI Key InChIKey=KXZZWRQJKQVMKR-UHFFFAOYSA-N
Data  8 IC50
  Tab Delimited (TSV)   2D SDfile   Computed 3D by Vconf -m prep SDfile
Find this compound or compounds like it in BindingDB:
Activity Spreadsheet -- Enzyme Inhibition Constant Data from BindingDB
Found 8 hits for monomerid = 50084726
TargetMatrix metalloproteinase-9(Homo sapiens (Human))
Procter And Gamble Pharmaceuticals
Curated by ChEMBL
LigandPNGBDBM50084726(4-(Biphenyl-4-carbonyl)-1-(4-methoxy-benzenesulfon...)
Affinity DataIC50:  0.900nM. Assay description: In vitro inhibitory activity against matrix metalloprotease-9 (MMP-9)
In DepthDetails ArticlePubMed
TargetInterstitial collagenase(Homo sapiens (Human))
Procter And Gamble Pharmaceuticals
Curated by ChEMBL
LigandPNGBDBM50084726(4-(Biphenyl-4-carbonyl)-1-(4-methoxy-benzenesulfon...)
Affinity DataIC50:  43nM. Assay description: In vitro inhibitory activity against matrix metalloprotease-1 (MMP-1)
In DepthDetails ArticlePubMed
TargetCollagenase 3(Homo sapiens (Human))
Procter And Gamble Pharmaceuticals
Curated by ChEMBL
LigandPNGBDBM50084726(4-(Biphenyl-4-carbonyl)-1-(4-methoxy-benzenesulfon...)
Affinity DataIC50:  0.900nM. Assay description: In vitro inhibitory activity against matrix metalloprotease-13 (MMP-13)
In DepthDetails ArticlePubMed
TargetFalcilysin(Plasmodium falciparum (isolate 3D7))
California State University
Curated by ChEMBL
LigandPNGBDBM50084726(4-(Biphenyl-4-carbonyl)-1-(4-methoxy-benzenesulfon...)
Affinity DataIC50:  1.00E+4nM. Assay description: Inhibition of Plasmodium falciparum 3D7 FLN (55 to 1193 residues) expressed in Escherichia coli BL21 using Dabcyl-HKRHSFRMRG-EDANS as substrate prein...
In DepthDetails ArticlePubMed
TargetStromelysin-1(Homo sapiens (Human))
Procter And Gamble Pharmaceuticals
Curated by ChEMBL
LigandPNGBDBM50084726(4-(Biphenyl-4-carbonyl)-1-(4-methoxy-benzenesulfon...)
Affinity DataIC50:  23nM. Assay description: In vitro inhibitory activity against matrix metalloprotease-3 (MMP-3)
In DepthDetails ArticlePubMed
TargetCollagenase 3(Homo sapiens (Human))
Procter And Gamble Pharmaceuticals
Curated by ChEMBL
LigandPNGBDBM50084726(4-(Biphenyl-4-carbonyl)-1-(4-methoxy-benzenesulfon...)
Affinity DataIC50:  0.891nM. Assay description: Inhibition of MMP13
In DepthDetails ArticlePubMed
TargetStromelysin-1(Homo sapiens (Human))
Procter And Gamble Pharmaceuticals
Curated by ChEMBL
LigandPNGBDBM50084726(4-(Biphenyl-4-carbonyl)-1-(4-methoxy-benzenesulfon...)
Affinity DataIC50:  23nM. Assay description: Binding affinity towards matrix metalloprotease-3
In DepthDetails ArticlePubMed
TargetMatrilysin(Homo sapiens (Human))
Procter And Gamble Pharmaceuticals
Curated by ChEMBL
LigandPNGBDBM50084726(4-(Biphenyl-4-carbonyl)-1-(4-methoxy-benzenesulfon...)
Affinity DataIC50:  931nM. Assay description: In vitro inhibitory activity against matrix metalloprotease-7 (MMP-7)
In DepthDetails ArticlePubMed