BDBM50084900 3-Dibenzofuran-3-yl-2-(5-methyl-1-phosphono-hexylamino)-propionic acid::CHEMBL148232
SMILES CC(C)CCCC(N[C@@H](Cc1ccc2c(c1)oc1ccccc21)C(O)=O)P(O)(O)=O
InChI Key InChIKey=YKDCMMCHDYEGSQ-YMXDCFFPSA-N
Data  2 IC50
  Tab Delimited (TSV)   2D SDfile   Computed 3D by Vconf -m prep SDfile
Find this compound or compounds like it in BindingDB:
Activity Spreadsheet -- Enzyme Inhibition Constant Data from BindingDB
Found 2 hits for monomerid = 50084900
TargetEndothelin-converting enzyme 1(Homo sapiens (Human))
Novartis Institute For Biomedical Research
Curated by ChEMBL
LigandPNGBDBM50084900(3-Dibenzofuran-3-yl-2-(5-methyl-1-phosphono-hexyla...)
Affinity DataIC50:  65nM. Assay description: In Vitro inhibition of recombinant human endothelin converting enzyme-1
In DepthDetails ArticlePubMed
TargetNeprilysin(Rattus norvegicus (Rat))
Novartis Institute For Biomedical Research
Curated by ChEMBL
LigandPNGBDBM50084900(3-Dibenzofuran-3-yl-2-(5-methyl-1-phosphono-hexyla...)
Affinity DataIC50: >1.60E+4nM. Assay description: In vitro inhibition of rat neutral endopeptidase
In DepthDetails ArticlePubMed