BDBM50085088 2-(2-Amino-3-methyl-butyrylamino)-3-phenyl-propionic acid butyl ester (1.25CF3COOH.0.5H2O)::CHEMBL158101
SMILES CCCCOC(=O)C(Cc1ccccc1)NC(=O)C(N)C(C)C
InChI Key InChIKey=NNRWHYYSNAKJDZ-UHFFFAOYSA-N
Data  1 KI
  Tab Delimited (TSV)   2D SDfile   Computed 3D by Vconf -m prep SDfile
Find this compound or compounds like it in BindingDB:
Activity Spreadsheet -- Enzyme Inhibition Constant Data from BindingDB
Found 1 hit for monomerid = 50085088
TargetTripeptidyl-peptidase 2(Rattus norvegicus)
University College London
Curated by ChEMBL
LigandPNGBDBM50085088(2-(2-Amino-3-methyl-butyrylamino)-3-phenyl-propion...)
Affinity DataKi:  2.30E+5nM. Assay description: Inhibition potency against Cholecystokinin-8-Inactivating Peptidase (Serine Peptidase).
In DepthDetails ArticlePubMed