BDBM50085096 2-(2-Amino-3-methyl-butyrylamino)-3-methyl-butyric acid (0.25H2O)::CHEMBL422892
SMILES CC(C)C(N)C(=O)NC(C(C)C)C(O)=O
InChI Key InChIKey=KRNYOVHEKOBTEF-UHFFFAOYSA-N
Data  1 KI
  Tab Delimited (TSV)   2D SDfile   Computed 3D by Vconf -m prep SDfile
Find this compound or compounds like it in BindingDB:
Activity Spreadsheet -- Enzyme Inhibition Constant Data from BindingDB
Found 1 hit for monomerid = 50085096
TargetTripeptidyl-peptidase 2(Rattus norvegicus)
University College London
Curated by ChEMBL
LigandPNGBDBM50085096(2-(2-Amino-3-methyl-butyrylamino)-3-methyl-butyric...)
Affinity DataKi:  1.67E+6nM. Assay description: Inhibition potency against Cholecystokinin-8-Inactivating Peptidase (Serine Peptidase).
In DepthDetails ArticlePubMed