BDBM50085101 2-Amino-3-methyl-N-(methylcarbamoyl-phenyl-methyl)-butyramide (0.5H2O)::CHEMBL158100
SMILES CNC(=O)C(NC(=O)C(N)C(C)C)c1ccccc1
InChI Key InChIKey=FRSBTKXVCXKMAQ-UHFFFAOYSA-N
Data  1 KI
  Tab Delimited (TSV)   2D SDfile   Computed 3D by Vconf -m prep SDfile
Find this compound or compounds like it in BindingDB:
Activity Spreadsheet -- Enzyme Inhibition Constant Data from BindingDB
Found 1 hit for monomerid = 50085101
TargetTripeptidyl-peptidase 2(Rattus norvegicus)
University College London
Curated by ChEMBL
LigandPNGBDBM50085101(2-Amino-3-methyl-N-(methylcarbamoyl-phenyl-methyl)...)
Affinity DataKi:  2.90E+4nM. Assay description: Inhibition potency against Cholecystokinin-8-Inactivating Peptidase (Serine Peptidase).
In DepthDetails ArticlePubMed