BDBM50085128 2-Amino-3-methyl-N-(4-phenyl-butyl)-butyramide::CHEMBL161769
SMILES CC(C)[C@H](N)C(=O)NCCCCc1ccccc1
InChI Key InChIKey=ARJWSURYQDYFSI-AWEZNQCLSA-N
Data  1 KI
  Tab Delimited (TSV)   2D SDfile   Computed 3D by Vconf -m prep SDfile
Find this compound or compounds like it in BindingDB:
Activity Spreadsheet -- Enzyme Inhibition Constant Data from BindingDB
Found 1 hit for monomerid = 50085128
TargetTripeptidyl-peptidase 2(Rattus norvegicus)
University College London
Curated by ChEMBL
LigandPNGBDBM50085128(2-Amino-3-methyl-N-(4-phenyl-butyl)-butyramide | C...)
Affinity DataKi:  3.30E+4nM. Assay description: Inhibition potency against Cholecystokinin-8-Inactivating Peptidase (Serine Peptidase).
In DepthDetails ArticlePubMed