BDBM50085130 2-(2-Amino-3-methyl-butyrylamino)-3-cyclohexyl-propionic acid(CF3COOH)::CHEMBL348859
SMILES CC(C)C(N)C(=O)NC(CC1CCCCC1)C(O)=O
InChI Key InChIKey=ZRHYCGMQPVCRJZ-UHFFFAOYSA-N
Data  1 KI
  Tab Delimited (TSV)   2D SDfile   Computed 3D by Vconf -m prep SDfile
Find this compound or compounds like it in BindingDB:
Activity Spreadsheet -- Enzyme Inhibition Constant Data from BindingDB
Found 1 hit for monomerid = 50085130
TargetTripeptidyl-peptidase 2(Rattus norvegicus)
University College London
Curated by ChEMBL
LigandPNGBDBM50085130(2-(2-Amino-3-methyl-butyrylamino)-3-cyclohexyl-pro...)
Affinity DataKi:  3.00E+6nM. Assay description: Inhibition potency against Cholecystokinin-8-Inactivating Peptidase (Serine Peptidase).
In DepthDetails ArticlePubMed