BDBM50085715 CHEMBL266300::DiCyclo (4-10/5,5'-8) [Ac-D Nal, D Cpa, D Pal, Asp, Glu(Gly), D Arg, Leu, Dbu, Pro, Dpr]GnRH
SMILES CC[C@H](NC(C)=O)C(=O)N[C@@H](Cc1ccc(Cl)cc1)C(=O)N[C@@H](Cc1cccnc1)C(=O)N[C@H]1CC(=O)NCC(NC(=O)[C@@H]2CCCN2C(=O)C2CCNC(=O)CNC(=O)CC[C@H](NC1=O)C(=O)N[C@@H](CCCNC(N)=N)C(=O)N[C@H](CC(C)C)C(=O)N2)C(N)=O
InChI Key InChIKey=ILLOEYUDLLLSNB-AZGOKXRASA-N
Data  1 KI
  Tab Delimited (TSV)   2D SDfile   Computed 3D by Vconf -m prep SDfile
Find this compound or compounds like it in BindingDB:
Activity Spreadsheet -- Enzyme Inhibition Constant Data from BindingDB
Found 1 hit for monomerid = 50085715
TargetGonadotropin-releasing hormone receptor(Rattus norvegicus)
Salk Institute
Curated by ChEMBL
LigandPNGBDBM50085715(CHEMBL266300 | DiCyclo (4-10/5,5'-8) [Ac-D Nal, D ...)
Affinity DataKi:  0.160nM. Assay description: Competitive radioligand binding assay, in human HEK-293 cells stably transfected with the rat Gonadotropin-releasing hormone receptor
In DepthDetails ArticlePubMed