BDBM50085799 CHEMBL439083::Gonadotropin Releasing Hormone analogue
SMILES CC(C)C[C@H]1NC(=O)[C@@H](Cc2ccc3ccccc3c2)NC(=O)[C@H]2CCNC(=O)CNC(=O)C[C@@H](NC(C)=O)C(=O)N[C@@H](Cc3ccc(Cl)cc3)C(=O)N[C@H](Cc3c[nH]c4ccccc34)C(=O)N[C@H](CC(=O)NC[C@@H](NC(=O)[C@H]3CCCN3C(=O)[C@H](CCCNC(N)=N)NC1=O)C(N)=O)C(=O)N2
InChI Key InChIKey=BFBAZLKDQFUBRH-HZHMLCAASA-N
Data  1 KI
  Tab Delimited (TSV)   2D SDfile   Computed 3D by Vconf -m prep SDfile
Find this compound or compounds like it in BindingDB:
Activity Spreadsheet -- Enzyme Inhibition Constant Data from BindingDB
Found 1 hit for monomerid = 50085799
TargetGonadotropin-releasing hormone receptor(Rattus norvegicus)
Salk Institute
Curated by ChEMBL
LigandPNGBDBM50085799(CHEMBL439083 | Gonadotropin Releasing Hormone anal...)
Affinity DataKi:  0.220nM. Assay description: Affinity for rat gonadotrophin releasing hormone (GnRH) receptor using HEK-293 cells transfected with rat Gonadotropin-releasing hormone receptor
In DepthDetails ArticlePubMed