BDBM50085895 3-Isopropyl-4-methyl-pentanoic acid 4-butylidene-2-hydroxymethyl-5-oxo-tetrahydro-furan-2-ylmethyl ester::CHEMBL440555
SMILES CCC\C=C1/CC(CO)(COC(=O)CC(C(C)C)C(C)C)OC1=O
InChI Key InChIKey=ZUYXWXQUMWAYKH-OVCLIPMQSA-N
Data  1 KI
  Tab Delimited (TSV)   2D SDfile   Computed 3D by Vconf -m prep SDfile
Find this compound or compounds like it in BindingDB:
Activity Spreadsheet -- Enzyme Inhibition Constant Data from BindingDB
Found 1 hit for monomerid = 50085895
TargetProtein kinase C alpha type(Homo sapiens (Human))
National Cancer Institute-Bethesda
Curated by ChEMBL
LigandPNGBDBM50085895(3-Isopropyl-4-methyl-pentanoic acid 4-butylidene-2...)
Affinity DataKi:  28nM. Assay description: Binding Affinity against protein kinase C alpha
In DepthDetails ArticlePubMed