BDBM50086394 CHEMBL3426046
SMILES O=C1CCCN1[C@H]1CC[C@@H](CC1)Nc1ncnc2ccc(cc12)-c1cncs1
InChI Key InChIKey=LPXYMTVRTJZZMF-WKILWMFISA-N
Data  2 IC50
  Tab Delimited (TSV)   2D SDfile   Computed 3D by Vconf -m prep SDfile
Find this compound or compounds like it in BindingDB:
Activity Spreadsheet -- Enzyme Inhibition Constant Data from BindingDB
Found 2 hits for monomerid = 50086394
TargetADP-ribosyl cyclase/cyclic ADP-ribose hydrolase 1(Mus musculus)
Glaxosmithkline
Curated by ChEMBL
LigandPNGBDBM50086394(CHEMBL3426046)
Affinity DataIC50:  77nM. Assay description: Inhibition of mouse recombinant CD38 extracellular domain expressed in CHO CGE cells assessed as NAD hydrolysis by fluorescence plate reader analysis
In DepthDetails ArticlePubMed
TargetADP-ribosyl cyclase/cyclic ADP-ribose hydrolase 1(Homo sapiens (Human))
Glaxosmithkline
Curated by ChEMBL
LigandPNGBDBM50086394(CHEMBL3426046)
Affinity DataIC50:  1.96E+3nM. Assay description: Inhibition of human CD38 extracellular domain expressed in Pichia pastoris assessed as NAD hydrolysis by colorimetric-based assay
In DepthDetails ArticlePubMed