BDBM50087238 2,2-Dimethyl-propionic acid 2-(2,2-dimethyl-propionyloxy)-1-hydroxymethyl-ethyl ester::CHEMBL157482
SMILES CC(C)(C)C(=O)OCC(CO)OC(=O)C(C)(C)C
InChI Key InChIKey=YNEXAFYJNJZSMP-UHFFFAOYSA-N
Data  1 KI
  Tab Delimited (TSV)   2D SDfile   Computed 3D by Vconf -m prep SDfile
Find this compound or compounds like it in BindingDB:
Activity Spreadsheet -- Enzyme Inhibition Constant Data from BindingDB
Found 1 hit for monomerid = 50087238
TargetProtein kinase C alpha type(Homo sapiens (Human))
National Cancer Institute-Bethesda
Curated by ChEMBL
LigandPNGBDBM50087238(2,2-Dimethyl-propionic acid 2-(2,2-dimethyl-propio...)
Affinity DataKi:  3.43E+3nM. Assay description: Displacement of [20-3H] phorbol 12,13-dibutyrate from protein kinase C alpha
In DepthDetails ArticlePubMed