BDBM50087269 (cis)-2-Aminomethyl-cyclopropanecarboxylic acid::(trans)-2-Aminomethyl-cyclopropanecarboxylic acid::CHEMBL284310
SMILES NCC1CC1C(O)=O
InChI Key InChIKey=QUFMERRXRMSAPZ-UHFFFAOYSA-N
Data  4 EC50
  Tab Delimited (TSV)   2D SDfile   Computed 3D by Vconf -m prep SDfile
Find this compound or compounds like it in BindingDB:
Activity Spreadsheet -- Enzyme Inhibition Constant Data from BindingDB
Found 4 hits for monomerid = 50087269
TargetGamma-aminobutyric acid receptor subunit rho-2(Homo sapiens (Human))
University Of Sydney
Curated by ChEMBL
LigandPNGBDBM50087269((cis)-2-Aminomethyl-cyclopropanecarboxylic acid | ...)
Affinity DataEC50:  1.75E+4nM. Assay description: Partial agonist activity with low efficacy against rho-2 subunit GABA-C receptor expressed in Xenopus oocytes
In DepthDetails ArticlePubMed
TargetGamma-aminobutyric acid receptor subunit rho-2(Homo sapiens (Human))
University Of Sydney
Curated by ChEMBL
LigandPNGBDBM50087269((cis)-2-Aminomethyl-cyclopropanecarboxylic acid | ...)
Affinity DataEC50:  3.45E+4nM. Assay description: Full agonist activity against human rho-2 subunit GABA-C receptor expressed in Xenopus oocytes
In DepthDetails ArticlePubMed
TargetGamma-aminobutyric acid receptor subunit rho-1(Homo sapiens (Human))
University Of Sydney
Curated by ChEMBL
LigandPNGBDBM50087269((cis)-2-Aminomethyl-cyclopropanecarboxylic acid | ...)
Affinity DataEC50:  2.00E+4nM. Assay description: Full agonist activity against human rho-1 subunit GABA-C receptor expressed in Xenopus oocytes
In DepthDetails ArticlePubMed
TargetGamma-aminobutyric acid receptor subunit rho-1(Homo sapiens (Human))
University Of Sydney
Curated by ChEMBL
LigandPNGBDBM50087269((cis)-2-Aminomethyl-cyclopropanecarboxylic acid | ...)
Affinity DataEC50:  6.80E+4nM. Assay description: Full agonist activity against human rho-1 subunit GABA-C receptor expressed in Xenopus oocytes
In DepthDetails ArticlePubMed