BDBM50087732 CHEMBL424733::Glucagon like peptide-1(GLP-1)analogue
SMILES CCCCCCCCCCCCCCCC(=O)NC(CCC(=O)NCCCC[C@H](NC(=O)[C@H](C)NC(=O)[C@H](C)NC(=O)[C@H](CCC(N)=O)NC(=O)CNC(=O)[C@H](CCC(O)=O)NC(=O)[C@H](CC(C)C)NC(=O)[C@H](Cc1ccc(O)cc1)NC(=O)[C@H](CO)NC(=O)[C@H](CO)NC(=O)[C@@H](NC(=O)[C@H](CC(O)=O)NC(=O)[C@H](CO)NC(=O)[C@@H](NC(=O)[C@H](Cc1ccccc1)NC(=O)[C@@H](NC(=O)CNC(=O)[C@H](CCC(O)=O)NC(=O)[C@H](C)NC(=O)CCc1c[nH]cn1)[C@@H](C)O)[C@@H](C)O)C(C)C)C(=O)N[C@@H](CCC(O)=O)C(=O)N[C@@H](Cc1ccccc1)C(=O)N[C@@H]([C@@H](C)CC)C(=O)N[C@@H](C)C(=O)N[C@@H](Cc1c[nH]c2ccccc12)C(=O)N[C@@H](CC(C)C)C(=O)N[C@@H](C(C)C)C(=O)N[C@@H](CCCN=C(N)N)C(=O)NCC(=O)N[C@@H](CCCN=C(N)N)C(=O)NCC(O)=O)C(O)=O
InChI Key InChIKey=YHTFSXHDBNKMTA-AWKZXERUSA-N
Data  1 EC50
  Tab Delimited (TSV)   2D SDfile   Computed 3D by Vconf -m prep SDfile
Find this compound or compounds like it in BindingDB:
Activity Spreadsheet -- Enzyme Inhibition Constant Data from BindingDB
Found 1 hit for monomerid = 50087732
TargetGlucagon-like peptide 1 receptor(Homo sapiens (Human))
Novo Nordisk
Curated by ChEMBL
LigandPNGBDBM50087732(CHEMBL424733 | Glucagon like peptide-1(GLP-1)analo...)
Affinity DataEC50:  0.687nM. Assay description: Potency measured using recombinant human GLP-1 receptor expressed in Baby Hamster Kidney (BHK)cells
In DepthDetails ArticlePubMed