BDBM50088094 CHEMBL298606::N-Hydroxy-2-[(4-nitro-benzenesulfonyl)-(4-nitro-benzyl)-amino]-acetamide
SMILES ONC(=O)CN(Cc1ccc(cc1)[N+]([O-])=O)S(=O)(=O)c1ccc(cc1)[N+]([O-])=O
InChI Key InChIKey=MMCVYPKEJGVLMH-UHFFFAOYSA-N
Data  5 KI
  Tab Delimited (TSV)   2D SDfile   Computed 3D by Vconf -m prep SDfile
Find this compound or compounds like it in BindingDB:
Activity Spreadsheet -- Enzyme Inhibition Constant Data from BindingDB
Found 5 hits for monomerid = 50088094
TargetNeutrophil collagenase(Homo sapiens (Human))
Università
Curated by ChEMBL
LigandPNGBDBM50088094(CHEMBL298606 | N-Hydroxy-2-[(4-nitro-benzenesulfon...)
Affinity DataKi:  7nM. Assay description: Inhibitory activity against the Matrix Metalloprotease-8
In DepthDetails ArticlePubMed
TargetMatrix metalloproteinase-9(Homo sapiens (Human))
Università
Curated by ChEMBL
LigandPNGBDBM50088094(CHEMBL298606 | N-Hydroxy-2-[(4-nitro-benzenesulfon...)
Affinity DataKi:  8nM. Assay description: Inhibitory activity against the Matrix metalloprotease-9
In DepthDetails ArticlePubMed
Target72 kDa type IV collagenase(Homo sapiens (Human))
Università
Curated by ChEMBL
LigandPNGBDBM50088094(CHEMBL298606 | N-Hydroxy-2-[(4-nitro-benzenesulfon...)
Affinity DataKi:  9nM. Assay description: Inhibitory activity against the Matrix Metalloprotease 2 (MMP-2)
In DepthDetails ArticlePubMed
LigandPNGBDBM50088094(CHEMBL298606 | N-Hydroxy-2-[(4-nitro-benzenesulfon...)
Affinity DataKi:  13nM. Assay description: Inhibitory activity against the Clostridium histolyticum collagenase (ChC)
In DepthDetails ArticlePubMed
TargetInterstitial collagenase(Homo sapiens (Human))
Università
Curated by ChEMBL
LigandPNGBDBM50088094(CHEMBL298606 | N-Hydroxy-2-[(4-nitro-benzenesulfon...)
Affinity DataKi:  15nM. Assay description: Inhibitory activity against the Matrix Metalloprotease 1 (MMP-1)
In DepthDetails ArticlePubMed