BDBM50088095 2-(N-(4-nitrobenzyl)-4-methoxyphenylsulfonamido)-N-hydroxyacetamide::CHEMBL293774::N-Hydroxy-2-[(4-methoxy-benzenesulfonyl)-(4-nitro-benzyl)-amino]-acetamide
SMILES COc1ccc(cc1)S(=O)(=O)N(CC(=O)NO)Cc1ccc(cc1)[N+]([O-])=O
InChI Key InChIKey=LOYIGNDQOZNJNZ-UHFFFAOYSA-N
Data  7 KI  1 IC50
  Tab Delimited (TSV)   2D SDfile   Computed 3D by Vconf -m prep SDfile
Find this compound or compounds like it in BindingDB:
Activity Spreadsheet -- Enzyme Inhibition Constant Data from BindingDB
Found 8 hits for monomerid = 50088095
Target72 kDa type IV collagenase(Homo sapiens (Human))
Pomona College
Curated by ChEMBL
LigandPNGBDBM50088095(2-(N-(4-nitrobenzyl)-4-methoxyphenylsulfonamido)-N...)
Affinity DataKi:  18nM. Assay description: Inhibition of MMP2
In DepthDetails ArticlePubMed
Target72 kDa type IV collagenase(Homo sapiens (Human))
Pomona College
Curated by ChEMBL
LigandPNGBDBM50088095(2-(N-(4-nitrobenzyl)-4-methoxyphenylsulfonamido)-N...)
Affinity DataKi:  18nM. Assay description: Inhibitory activity against the Matrix Metalloprotease 2 (MMP-2)
In DepthDetails ArticlePubMed
LigandPNGBDBM50088095(2-(N-(4-nitrobenzyl)-4-methoxyphenylsulfonamido)-N...)
Affinity DataKi:  20nM. Assay description: Inhibitory activity against the Clostridium histolyticum collagenase (ChC)
In DepthDetails ArticlePubMed
TargetNeutrophil collagenase(Homo sapiens (Human))
Università
Curated by ChEMBL
LigandPNGBDBM50088095(2-(N-(4-nitrobenzyl)-4-methoxyphenylsulfonamido)-N...)
Affinity DataKi:  21nM. Assay description: Inhibitory activity against the Matrix Metalloprotease-8
In DepthDetails ArticlePubMed
TargetInterstitial collagenase(Homo sapiens (Human))
Università
Curated by ChEMBL
LigandPNGBDBM50088095(2-(N-(4-nitrobenzyl)-4-methoxyphenylsulfonamido)-N...)
Affinity DataKi:  28nM. Assay description: Inhibitory activity against the Matrix Metalloprotease 1 (MMP-1)
In DepthDetails ArticlePubMed
TargetMatrix metalloproteinase-9(Homo sapiens (Human))
Università
Curated by ChEMBL
LigandPNGBDBM50088095(2-(N-(4-nitrobenzyl)-4-methoxyphenylsulfonamido)-N...)
Affinity DataKi:  31nM. Assay description: Inhibitory activity against the Matrix metalloprotease-9
In DepthDetails ArticlePubMed
TargetMatrix metalloproteinase-9(Homo sapiens (Human))
Università
Curated by ChEMBL
LigandPNGBDBM50088095(2-(N-(4-nitrobenzyl)-4-methoxyphenylsulfonamido)-N...)
Affinity DataKi:  31nM. Assay description: Inhibition of MMP9
In DepthDetails ArticlePubMed
TargetInterstitial collagenase(Homo sapiens (Human))
Università
Curated by ChEMBL
LigandPNGBDBM50088095(2-(N-(4-nitrobenzyl)-4-methoxyphenylsulfonamido)-N...)
Affinity DataIC50:  28nM. Assay description: Inhibition of MMP1
In DepthDetails ArticlePubMed