BDBM50088114 3-[Hydroxycarbamoylmethyl-(4-nitro-benzyl)-sulfamoyl]-benzoic acid::CHEMBL56025
SMILES ONC(=O)CN(Cc1ccc(cc1)[N+]([O-])=O)S(=O)(=O)c1cccc(c1)C(O)=O
InChI Key InChIKey=ULPVLGUDYQAPPV-UHFFFAOYSA-N
Data  5 KI
  Tab Delimited (TSV)   2D SDfile   Computed 3D by Vconf -m prep SDfile
Find this compound or compounds like it in BindingDB:
Activity Spreadsheet -- Enzyme Inhibition Constant Data from BindingDB
Found 5 hits for monomerid = 50088114
TargetMatrix metalloproteinase-9(Homo sapiens (Human))
Università
Curated by ChEMBL
LigandPNGBDBM50088114(3-[Hydroxycarbamoylmethyl-(4-nitro-benzyl)-sulfamo...)
Affinity DataKi:  2.5nM. Assay description: Inhibitory activity against the Matrix metalloprotease-9
In DepthDetails ArticlePubMed
Target72 kDa type IV collagenase(Homo sapiens (Human))
Università
Curated by ChEMBL
LigandPNGBDBM50088114(3-[Hydroxycarbamoylmethyl-(4-nitro-benzyl)-sulfamo...)
Affinity DataKi:  3nM. Assay description: Inhibitory activity against the Matrix Metalloprotease 2 (MMP-2)
In DepthDetails ArticlePubMed
TargetNeutrophil collagenase(Homo sapiens (Human))
Università
Curated by ChEMBL
LigandPNGBDBM50088114(3-[Hydroxycarbamoylmethyl-(4-nitro-benzyl)-sulfamo...)
Affinity DataKi:  3.30nM. Assay description: Inhibitory activity against the Matrix Metalloprotease-8
In DepthDetails ArticlePubMed
LigandPNGBDBM50088114(3-[Hydroxycarbamoylmethyl-(4-nitro-benzyl)-sulfamo...)
Affinity DataKi:  10nM. Assay description: Inhibitory activity against the Clostridium histolyticum collagenase (ChC)
In DepthDetails ArticlePubMed
TargetInterstitial collagenase(Homo sapiens (Human))
Università
Curated by ChEMBL
LigandPNGBDBM50088114(3-[Hydroxycarbamoylmethyl-(4-nitro-benzyl)-sulfamo...)
Affinity DataKi:  41nM. Assay description: Inhibitory activity against the Matrix Metalloprotease 1 (MMP-1)
In DepthDetails ArticlePubMed