BDBM50088817 CHEMBL355288::Sodium; 3-cyano-5,5,8-trioxo-7-[1-pyridin-2-yl-meth-(Z)-ylidene]-5lambda*6*-thia-1-aza-bicyclo[4.2.0]oct-2-ene-2-carboxylate
SMILES [O-]C(=O)C1=C(CS(=O)(=O)C2N1C(=O)\C2=C\c1ccccn1)C#N
InChI Key InChIKey=VCLJFUZKQOYWOD-YHYXMXQVSA-M
Data  3 IC50
  Tab Delimited (TSV)   2D SDfile   Computed 3D by Vconf -m prep SDfile
Find this compound or compounds like it in BindingDB:
Activity Spreadsheet -- Enzyme Inhibition Constant Data from BindingDB
Found 3 hits for monomerid = 50088817
TargetBeta-lactamase(Enterobacter cloacae)
Southern Methodist University
Curated by ChEMBL
LigandPNGBDBM50088817(CHEMBL355288 | Sodium; 3-cyano-5,5,8-trioxo-7-[1-p...)
Affinity DataIC50:  29nM. Assay description: Inhibition of class C beta-lactamase derived from Enterobacter cloacae P99
In DepthDetails ArticlePubMed
TargetBeta-lactamase(Enterobacter cloacae)
Southern Methodist University
Curated by ChEMBL
LigandPNGBDBM50088817(CHEMBL355288 | Sodium; 3-cyano-5,5,8-trioxo-7-[1-p...)
Affinity DataIC50:  2.34E+3nM. Assay description: Inhibition of class A TEM-1 beta-lactamase derived from Enterobacter cloacae
In DepthDetails ArticlePubMed
TargetBeta-lactamase(Staphylococcus aureus)
Southern Methodist University
Curated by ChEMBL
LigandPNGBDBM50088817(CHEMBL355288 | Sodium; 3-cyano-5,5,8-trioxo-7-[1-p...)
Affinity DataIC50:  2.80E+5nM. Assay description: Inhibition of class A beta-lactamase derived from Staphylococcus aureus strain PC1
In DepthDetails ArticlePubMed