BDBM50088818 CHEMBL353978::Sodium; 3-methoxymethyl-5,5,8-trioxo-7-[1-pyridin-2-yl-meth-(Z)-ylidene]-5lambda*6*-thia-1-aza-bicyclo[4.2.0]oct-2-ene-2-carboxylate
SMILES COCC1=C(N2C(\C(=C/c3ccccn3)C2=O)S(=O)(=O)C1)C([O-])=O
InChI Key InChIKey=KEDIJSGTHCTLIW-WDZFZDKYSA-M
Data  4 IC50
  Tab Delimited (TSV)   2D SDfile   Computed 3D by Vconf -m prep SDfile
Find this compound or compounds like it in BindingDB:
Activity Spreadsheet -- Enzyme Inhibition Constant Data from BindingDB
Found 4 hits for monomerid = 50088818
TargetBeta-lactamase(Enterobacter cloacae)
Southern Methodist University
Curated by ChEMBL
LigandPNGBDBM50088818(CHEMBL353978 | Sodium; 3-methoxymethyl-5,5,8-triox...)
Affinity DataIC50:  700nM. Assay description: Inhibition of class C beta-lactamase derived from Enterobacter cloacae P99
In DepthDetails ArticlePubMed
TargetBeta-lactamase(Enterobacter cloacae)
Southern Methodist University
Curated by ChEMBL
LigandPNGBDBM50088818(CHEMBL353978 | Sodium; 3-methoxymethyl-5,5,8-triox...)
Affinity DataIC50:  1.20E+3nM. Assay description: Affinity for alpha4-beta1 integrin from HL60 cell lysate
In DepthDetails ArticlePubMed
TargetBeta-lactamase(Enterobacter cloacae)
Southern Methodist University
Curated by ChEMBL
LigandPNGBDBM50088818(CHEMBL353978 | Sodium; 3-methoxymethyl-5,5,8-triox...)
Affinity DataIC50:  700nM. Assay description: Inhibition of class A TEM-1 beta-lactamase derived from Enterobacter cloacae
In DepthDetails ArticlePubMed
TargetBeta-lactamase(Staphylococcus aureus)
Southern Methodist University
Curated by ChEMBL
LigandPNGBDBM50088818(CHEMBL353978 | Sodium; 3-methoxymethyl-5,5,8-triox...)
Affinity DataIC50:  2.80E+4nM. Assay description: Inhibition of class A beta-lactamase derived from Staphylococcus aureus strain PC1
In DepthDetails ArticlePubMed