BDBM50088823 CHEMBL169303::Sodium; 3-[2-(3,4-dihydroxy-phenyl)-acetoxymethyl]-5,5,8-trioxo-7-[1-pyridin-2-yl-meth-(Z)-ylidene]-5lambda*6*-thia-1-aza-bicyclo[4.2.0]oct-2-ene-2-carboxylate
SMILES Oc1ccc(CC(=O)OCC2=C(N3C(\C(=C/c4ccccn4)C3=O)S(=O)(=O)C2)C([O-])=O)cc1O
InChI Key InChIKey=KYYKKYMWINILDR-DHDCSXOGSA-M
Data  3 IC50
  Tab Delimited (TSV)   2D SDfile   Computed 3D by Vconf -m prep SDfile
Find this compound or compounds like it in BindingDB:
Activity Spreadsheet -- Enzyme Inhibition Constant Data from BindingDB
Found 3 hits for monomerid = 50088823
TargetBeta-lactamase(Enterobacter cloacae)
Southern Methodist University
Curated by ChEMBL
LigandPNGBDBM50088823(CHEMBL169303 | Sodium; 3-[2-(3,4-dihydroxy-phenyl)...)
Affinity DataIC50:  3.60E+3nM. Assay description: Inhibition of class C beta-lactamase derived from Enterobacter cloacae P99
In DepthDetails ArticlePubMed
TargetBeta-lactamase(Staphylococcus aureus)
Southern Methodist University
Curated by ChEMBL
LigandPNGBDBM50088823(CHEMBL169303 | Sodium; 3-[2-(3,4-dihydroxy-phenyl)...)
Affinity DataIC50:  6.70E+4nM. Assay description: Inhibition of class A beta-lactamase derived from Staphylococcus aureus strain PC1
In DepthDetails ArticlePubMed
TargetBeta-lactamase(Enterobacter cloacae)
Southern Methodist University
Curated by ChEMBL
LigandPNGBDBM50088823(CHEMBL169303 | Sodium; 3-[2-(3,4-dihydroxy-phenyl)...)
Affinity DataIC50:  1.74E+4nM. Assay description: Inhibition of class A TEM-1 beta-lactamase derived from Enterobacter cloacae
In DepthDetails ArticlePubMed