BDBM50088830 CHEMBL353230::Sodium; 3-((E)-2-tert-butoxycarbonyl-vinyl)-5,5,8-trioxo-7-[1-pyridin-2-yl-meth-(Z)-ylidene]-5lambda*6*-thia-1-aza-bicyclo[4.2.0]oct-2-ene-2-carboxylate
SMILES CC(C)(C)OC(=O)\C=C\C1=C(N2C(\C(=C/c3ccccn3)C2=O)S(=O)(=O)C1)C([O-])=O
InChI Key InChIKey=HMIPDTUGLHDMRW-FAGQLRNJSA-M
Data  2 IC50
  Tab Delimited (TSV)   2D SDfile   Computed 3D by Vconf -m prep SDfile
Find this compound or compounds like it in BindingDB:
Activity Spreadsheet -- Enzyme Inhibition Constant Data from BindingDB
Found 2 hits for monomerid = 50088830
TargetBeta-lactamase(Staphylococcus aureus)
Southern Methodist University
Curated by ChEMBL
LigandPNGBDBM50088830(CHEMBL353230 | Sodium; 3-((E)-2-tert-butoxycarbony...)
Affinity DataIC50:  2.40E+5nM. Assay description: Inhibition of class A beta-lactamase derived from Staphylococcus aureus strain PC1
In DepthDetails ArticlePubMed
TargetBeta-lactamase(Enterobacter cloacae)
Southern Methodist University
Curated by ChEMBL
LigandPNGBDBM50088830(CHEMBL353230 | Sodium; 3-((E)-2-tert-butoxycarbony...)
Affinity DataIC50:  1.48E+3nM. Assay description: Inhibition of class C beta-lactamase derived from Enterobacter cloacae P99
In DepthDetails ArticlePubMed