BDBM50088999 2-[(1-Acetyl-pyrrolidine-2-carbonyl)-amino]-3-{2-[(adamantane-1-carbonyl)-amino]-2-methoxycarbonyl-ethyldisulfanyl}-propionic acid::CHEMBL368524
SMILES COC(=O)[C@H](CSSC[C@H](NC(=O)[C@@H]1CCCN1C(C)=O)C(O)=O)NC(=O)C12CC3CC(CC(C3)C1)C2
InChI Key InChIKey=YDYAANGTXBLIKA-JTMBZJAXSA-N
Data  1 IC50
  Tab Delimited (TSV)   2D SDfile   Computed 3D by Vconf -m prep SDfile
Find this compound or compounds like it in BindingDB:
Activity Spreadsheet -- Enzyme Inhibition Constant Data from BindingDB
Found 1 hit for monomerid = 50088999
TargetIntegrin alpha-4/beta-1(Homo sapiens (Human))
Celltech Chiroscience
Curated by ChEMBL
LigandPNGBDBM50088999(2-[(1-Acetyl-pyrrolidine-2-carbonyl)-amino]-3-{2-[...)
Affinity DataIC50:  2.52E+4nM. Assay description: Inhibition of VCAM (vascular cell adhesion molecule) adhesion to alpha4-beta1 integrin of leukocyte cells
In DepthDetails ArticlePubMed