BDBM50089413 CHEMBL3577995
SMILES [H][C@@]12CCCN1C(=O)[C@@]1([H])CCCN1C(=O)[C@H](Cc1ccccc1)NC(=O)[C@H](C)NC(=O)CNC(=O)[C@H](Cc1ccccc1)NC(=O)[C@H](Cc1ccccc1)NC(=O)[C@H](CCCNC(N)=N)NC2=O
InChI Key InChIKey=WMSRBVZRMJAEOB-VTXVSAOZSA-N
Data  2 KI  1 EC50
  Tab Delimited (TSV)   2D SDfile   Computed 3D by Vconf -m prep SDfile
Find this compound or compounds like it in BindingDB:
Activity Spreadsheet -- Enzyme Inhibition Constant Data from BindingDB
Found 2 hits for monomerid = 50089413
TargetMelanocortin receptor 4(Mus musculus)
University Of Minnesota
Curated by ChEMBL
LigandPNGBDBM50089413(CHEMBL3577995)
Affinity DataKi:  4nM. Assay description: Displacement of MTII from mouse MC4R expressed in HEK293 cells
In DepthDetails ArticlePubMed
TargetMelanocortin receptor 3(Mus musculus)
University Of Minnesota
Curated by ChEMBL
LigandPNGBDBM50089413(CHEMBL3577995)
Affinity DataKi:  25nM. Assay description: Displacement of MTII from mouse MC3R expressed in HEK293 cells
In DepthDetails ArticlePubMed