BDBM50089701 5,7-Diamino-[1,2,5]oxadiazolo[3,4-d]pyrimidin-1-ol::CHEMBL26029
SMILES Nc1nc(N)c2[n+]([O-])onc2n1
InChI Key InChIKey=QRAJKLHQNILRIW-UHFFFAOYSA-N
Data  1 KI
  Tab Delimited (TSV)   2D SDfile   Computed 3D by Vconf -m prep SDfile
Find this compound or compounds like it in BindingDB:
Activity Spreadsheet -- Enzyme Inhibition Constant Data from BindingDB
Found 1 hit for monomerid = 50089701
TargetAdenosine transporter 1(Trypanosoma brucei)
Universit£
Curated by ChEMBL
LigandPNGBDBM50089701(5,7-Diamino-[1,2,5]oxadiazolo[3,4-d]pyrimidin-1-ol...)
Affinity DataKi:  1.17E+5nM. Assay description: Compound was tested for inhibition of Adenosine transporter P2 type by using [2-3H]adenosine as radioligand in Trypanosoma equiperdum
In DepthDetails ArticlePubMed