BDBM50089706 2-(acetylamino)-N-(6-aminopyridin-3-yl)-3-methyl-3-(nitrosothio)butanamide::CHEMBL27352
SMILES CC(=O)NC(C(=O)Nc1ccc(N)nc1)C(C)(C)SN=O
InChI Key InChIKey=SAPYECKPXDXYTE-UHFFFAOYSA-N
Data  1 KI
  Tab Delimited (TSV)   2D SDfile   Computed 3D by Vconf -m prep SDfile
Find this compound or compounds like it in BindingDB:
Activity Spreadsheet -- Enzyme Inhibition Constant Data from BindingDB
Found 1 hit for monomerid = 50089706
TargetAdenosine transporter 1(Trypanosoma brucei)
Universit£
Curated by ChEMBL
LigandPNGBDBM50089706(2-(acetylamino)-N-(6-aminopyridin-3-yl)-3-methyl-3...)
Affinity DataKi:  4.04E+5nM. Assay description: Compound was tested for inhibition of Adenosine transporter P2 type by using [2-3H]adenosine as radioligand in Trypanosoma equiperdum
In DepthDetails ArticlePubMed