BDBM50089776 CHEMBL283629::Potassium; (4R,5R,6S)-6-((R)-1-hydroxy-ethyl)-3-methoxy-4-methyl-7-oxo-1-aza-bicyclo[3.2.0]hept-2-ene-2-carboxylate
SMILES COC1=C(N2C([C@@H]([C@@H](C)O)C2=O)[C@H]1C)C([O-])=O
InChI Key InChIKey=XUUNBOUAUWVPDD-RKEPMNIXSA-M
Data  2 IC50
  Tab Delimited (TSV)   2D SDfile   Computed 3D by Vconf -m prep SDfile
Find this compound or compounds like it in BindingDB:
Activity Spreadsheet -- Enzyme Inhibition Constant Data from BindingDB
Found 2 hits for monomerid = 50089776
TargetBeta-lactamase TEM(Escherichia coli)
University Of Munich
Curated by ChEMBL
LigandPNGBDBM50089776(CHEMBL283629 | Potassium; (4R,5R,6S)-6-((R)-1-hydr...)
Affinity DataIC50:  130nM. Assay description: Beta-Lactamase inhibition activity after 15 min of preincubation with the enzyme isolated from Escherichia coli 205 TEM
In DepthDetails ArticlePubMed
TargetBeta-lactamase(Enterobacter cloacae)
University Of Munich
Curated by ChEMBL
LigandPNGBDBM50089776(CHEMBL283629 | Potassium; (4R,5R,6S)-6-((R)-1-hydr...)
Affinity DataIC50:  2.10E+3nM. Assay description: Beta-Lactamase inhibition activity after 15 min of preincubation with the enzyme isolated from Enterobacter cloacae
In DepthDetails ArticlePubMed