BDBM50090311 CHEMBL435576::N-[3-(4-Phenyl-piperazin-1-yl)-propyl]-2,2-di-p-tolyl-acetamide
SMILES Cc1ccc(cc1)C(C(=O)NCCCN1CCN(CC1)c1ccccc1)c1ccc(C)cc1
InChI Key InChIKey=CQRJIWLCJUYMPE-UHFFFAOYSA-N
Data  3 KI
  Tab Delimited (TSV)   2D SDfile   Computed 3D by Vconf -m prep SDfile
Find this compound or compounds like it in BindingDB:
Activity Spreadsheet -- Enzyme Inhibition Constant Data from BindingDB
Found 3 hits for monomerid = 50090311
TargetAlpha-1A adrenergic receptor(Homo sapiens (Human))
Merck
Curated by ChEMBL
LigandPNGBDBM50090311(CHEMBL435576 | N-[3-(4-Phenyl-piperazin-1-yl)-prop...)
Affinity DataKi:  12nM. Assay description: Inhibition of binding of [125I]-HEAT to cloned human alpha-1A adrenergic receptor.
In DepthDetails ArticlePubMed
TargetAlpha-1B adrenergic receptor(Homo sapiens (Human))
Merck
Curated by ChEMBL
LigandPNGBDBM50090311(CHEMBL435576 | N-[3-(4-Phenyl-piperazin-1-yl)-prop...)
Affinity DataKi:  23nM. Assay description: Inhibition of binding of [125I]-HEAT to cloned human alpha-1B adrenergic receptor.
In DepthDetails ArticlePubMed
TargetAlpha-1D adrenergic receptor(Homo sapiens (Human))
Merck
Curated by ChEMBL
LigandPNGBDBM50090311(CHEMBL435576 | N-[3-(4-Phenyl-piperazin-1-yl)-prop...)
Affinity DataKi:  128nM. Assay description: Inhibition of binding of [125I]-HEAT to cloned human alpha-1D adrenergic receptor.
In DepthDetails ArticlePubMed