BDBM50091371 1-{4-[3-(1H-Imidazol-4-yl)-propoxy]-2-methyl-phenyl}-ethanone oxime::CHEMBL115091
SMILES CC(N=O)c1ccc(OCCCc2cnc[nH]2)cc1C
InChI Key InChIKey=BPRVJRFQMRWBKB-UHFFFAOYSA-N
Data  1 KI
  Tab Delimited (TSV)   2D SDfile   Computed 3D by Vconf -m prep SDfile
Find this compound or compounds like it in BindingDB:
Activity Spreadsheet -- Enzyme Inhibition Constant Data from BindingDB
Found 1 hit for monomerid = 50091371
TargetHistamine H3 receptor(Rattus norvegicus (rat))
Freie UniversitäT Berlin
Curated by ChEMBL
LigandPNGBDBM50091371(1-{4-[3-(1H-Imidazol-4-yl)-propoxy]-2-methyl-pheny...)
Affinity DataKi:  1.40nM. Assay description: Histamine H3 receptor antagonist activity in an assay with K+ evoked depolarization-induced release of [3H]-histamine from rat synaptosomes.
In DepthDetails ArticlePubMed